ID,Email,First Name,Last Name,Address 1,Address 2,City,State,Country,Zip / Postal Code,Form ID,Form Name,Amount ($),Payment Method,Transaction ID,Key,Date,User,Status
5893,conflict@givewp.com,Conflict,Testing,,,,,,,5570,New Form,27,Test Donation,5893,e30f5878f5ad59245660847a1311cbc3,04/28/2017 14:59,guest,Complete
5891,testingecom@givewp.com,Testing,Ecomm,,,,,,,5570,New Form,20,Test Donation,5891,175448b9ca8077e96c2c5e869938edc1,04/28/2017 14:55,guest,Complete
5889,haftner@example.com,Noah,Haftner,,,,,,,5833,Give to a Great Cause,6,Test Donation,5889,da2147fff4a226ef0f34640aed55e88b,04/27/2017 16:27,Noah,Complete
5887,haftner@example.com,Noah,Haftner,,,,,,,5833,Give to a Great Cause,5,Test Donation,5887,d99e7b6d19f8065688701358a24a149f,04/27/2017 16:23,Noah,Complete
5876,haftner@example.com,Noah,Haftner,,,,,,,5835,Give to a Great Cause,6.6,Test Donation,5876,c06864435ed43495fff0fa4f7b092262,04/25/2017 11:10,Noah,Complete
5873,haftner@example.com,Noah,Haftner,,,,,,,5835,Give to a Great Cause,6.5,Test Donation,5873,3afc899fcb6e65bd30339cebf14b1c76,04/25/2017 11:09,Noah,Complete
5869,haftner@example.com,Noah,Haftner,,,,,,,5835,Give to a Great Cause,6.01,Test Donation,5869,cb92656cfbacca8a72f224413916b809,04/25/2017 11:05,Noah,Complete
5865,haftner@example.com,Noah,Haftner,,,,,,,5835,Give to a Great Cause,6,Test Donation,5865,19225a500a6aac3c1bca42a962853e2e,04/25/2017 11:04,Noah,Complete
5861,haftner@example.com,Noah,Haftner,,,,,,,5835,Give to a Great Cause,5,Test Donation,5861,18c827d052212aad241b9af48460c61d,04/25/2017 11:03,Noah,Complete
5857,haftner@example.com,Noah,Haftner,,,,,,,5835,Give to a Great Cause,5,Test Donation,5857,ee75a4e62d0f09b8d0b235730e4098fe,04/25/2017 11:00,Noah,Complete
5852,haftner@example.com,Noah,Haftner,,,,,,,5835,Give to a Great Cause,25,Test Donation,5852,207cc10a837c0a9e6dc51640d81023c6,04/25/2017 10:56,Noah,Complete
5847,haftner@example.com,Noah,Haftner,,,,,,,5835,Give to a Great Cause,5,Test Donation,5847,1970d504674e2d0992c4bdd9a2a2659a,04/25/2017 10:55,Noah,Complete
5845,haftner@example.com,Noah,Haftner,,,,,,,5835,Give to a Great Cause,25,Test Donation,5845,412469180a7b0dbe2f5fb406aa9af14e,04/25/2017 10:53,Noah,Complete
5843,haftner@example.com,Noah,Haftner,,,,,,,5835,Give to a Great Cause,5,Test Donation,5843,d5a89f8e8d83deb6dd3d82d9d207978c,04/25/2017 10:52,Noah,Complete
5840,testing@givewp.com,John,Doe,,,,,,,5835,Give to a Great Cause,25,Test Donation,5840,127dbfc4a7ca79bbcf96c00944ade8a1,04/19/2017 19:32,Test Donor,Complete
5838,testing@givewp.com,John,Doe,,,,,,,5835,Give to a Great Cause,25,Test Donation,5838,2e5133206690844445c25fcaf1f55b9f,04/19/2017 19:30,Test Donor,Complete
5824,tester3@tester.com,Tester,Tesert,1234,,San Dieg,CA,US,92101,5798,In Honor Of,51,stripe,ch_ANvLb88HBy0JL4,2ca52730c3607d1ae7e40d0bf3ed2ada,03/30/2017 13:03,guest,Complete
5820,teserson@testing.com,Testerson,McTesterson,,,,,,,5798,In Honor Of,250,Test Donation,5820,e1b6581a001950da564fa91c4d8a47a4,03/30/2017 12:51,guest,Complete
5816,haftner@example.com,Noah,Haftner,,,,,,,5798,In Honor Of,11.11,Test Donation,5816,c8f1eb9906599e16881f1b52716cc01f,03/29/2017 16:53,Noah,Complete
5812,haftner@example.com,Noah,Haftner,,,,,,,5798,In Honor Of,51,Test Donation,5812,bde4cd7e1a1e91d80444113460617fec,03/29/2017 16:52,Noah,Complete
5808,haftner@example.com,Noah,Haftner,,,,,,,5798,In Honor Of,50,Test Donation,5808,601bfffe25510fb4944e0c328bc35c69,03/29/2017 16:52,Noah,Complete
5804,haftner@example.com,Noah,Haftner,,,,,,,5798,In Honor Of,1,Test Donation,5804,eae4a35b6c052e49f9db2613290a59f5,03/29/2017 15:02,Noah,Complete
5800,haftner@example.com,Noah,Haftner,,,,,,,5798,In Honor Of,1,Test Donation,5800,e0d7c447bf8ad4673a9fc955dfb92fde,03/29/2017 14:45,Noah,Complete
5789,testing@givewp.com,Matt,Smith,,,,,,,5570,New Form,25,Test Donation,5789,668ff3c8199c84a790b81fa1279076e8,03/17/2017 10:45,Test Donor,Complete
5786,testing@givewp.com,Testing,Tester,1234 St,,San Diego,CA,US,92101,5570,New Form,100,PayPal Standard,,8adaf27247d97edab50f5e0e08293968,03/10/2017 11:13,Test Donor,Abandoned
5785,testing@givewp.com,Give,Testing,1234 Street Street,Suite #201,San Diego,CA,US,92101,5570,New Form,100,PayPal Standard,,6e34cc2fb554b395dd5f649deb8de1f2,03/10/2017 11:12,Test Donor,Abandoned
5784,haftner@example.com,Noah,Haftner,1234 Awesome Street,Suite #201,San Diego,CA,US,92115,5570,New Form,100,PayPal Standard,,8017574cb42a5a905a3d64dfbd2215d9,03/10/2017 11:10,Noah,Failed
5783,haftner@example.com,Noah,Haftner,1234 Awesome Street,Suite #201,San Diego,CA,US,92115,5570,New Form,100,PayPal Standard,,957e6b58696978470fb4378d522953c3,03/10/2017 11:07,Noah,Abandoned
5778,testing@givewp.com,Test,Donor,,,,,,,5570,New Form,100,stripe,ch_AFoZJl7FoOtvn0,0668a972842ddd2c93d57f52c6e31c67,03/09/2017 04:31,Test Donor,Complete
5774,testing2@givewp.com,Test,Donor,,,,,,,5570,New Form,100,stripe,ch_AFoWi8RLKgKGQT,981f9c0830472db25a8462ef166fd48b,03/09/2017 04:29,Test2 Donor2,Complete
5770,testing@givewp.com,test,donor,,,,,,,5570,New Form,100,Test Donation,5770,db5acc5ef7850aefc1a815d4446717cb,03/09/2017 04:25,Test Donor,Complete
5766,haftner@example.com,Noah,Haftner,,,,,,,5570,New Form,100,Test Donation,5766,00e6c944ad7d182496c58a05c42d2857,03/09/2017 04:23,Noah,Complete
5762,haftner@example.com,Noah,Haftner,,,,,,,5570,New Form,100,Test Donation,5762,852117cd4d9b9606e46d594dea8753ef,03/09/2017 04:22,Noah,Complete
5758,haftner@example.com,Noah,Haftner,,,,,,,5570,New Form,"1,000.00",Test Donation,5758,f9b6aaaa5cbb22dfedcadc2544d397ba,03/09/2017 04:18,Noah,Complete
5754,testing@testing.com,Testing,Testing,,,,,,,5570,New Form,"10,000.00",stripe,ch_AFjeJ9eK7UOWVR,7a98ffb477f56697511b36e0517d7cd9,03/08/2017 23:27,testing2,Complete
5740,testing123@givewp.com,Give,Support,,,,,,,5634,Simple Recurring Donors Choice,25,stripe,5740,9e63b78e421f1e070639b838d1dc5599,03/06/2017 21:49,guest,Complete
5732,haftner@example.com,Noah,Haftner,,,,,,,5570,New Form,10,iats,A9914AE9,1306e6234d6c1e5a2f40fb46ac2080d5,03/02/2017 19:44,Noah,Complete
5724,haftner@example.com,Noah,Haftner,,,,,,,5634,Simple Recurring Donors Choice,25,Test Donation,5724,855ee5c755994fe42c2d7930847ccc4f,03/02/2017 01:08,Noah,Complete
5713,fallback@givewp.com,Stripe,Fallback,,,,,,,5634,Simple Recurring Donors Choice,25,stripe,5713,e250566752af31676c13141d371eca32,02/24/2017 01:40,Stripe Fallback,Complete
5693,membership@givewp.com,Member,Presser,,,,,,,5634,Simple Recurring Donors Choice,25,stripe,5693,16bbf6dd9c60c747647fc8f585888861,02/24/2017 01:33,Member Presser,Complete
5677,haftner@example.com,Noah,Haftner,,,,,,,5634,Simple Recurring Donors Choice,25,Test Donation,5677,176b7b88db44d84b91c92ef09e1fd424,02/23/2017 23:51,Noah,Complete
5673,haftner@example.com,Noah,Haftner,,,,,,,5634,Simple Recurring Donors Choice,25,Test Donation,5673,f2a933bd37a102cdff54de50595d8ae5,02/23/2017 23:50,Noah,Complete
5669,haftner@example.com,Noah,Haftner,,,,,,,5634,Simple Recurring Donors Choice,15,Test Donation,5669,41f714a3b3bf698ba601350b9cb9ab41,02/23/2017 23:50,Noah,Complete
5665,haftner@example.com,Noah,Haftner,,,,,,,5634,Simple Recurring Donors Choice,10,Test Donation,5665,0bd4813de44a777a6158982723f65683,02/23/2017 23:50,Noah,Complete
5661,haftner@example.com,Noah,Haftner,,,,,,,5634,Simple Recurring Donors Choice,25,Test Donation,5661,e56f1846382b29e35fd372e65295f7f2,02/23/2017 23:27,Noah,Complete
5650,testing@givewp.com,Give,Support,,,,,,,5632,Simple Recurring Admin Choice,100,stripe,5650,8d14af8302cdb3b07cbdfd6a3d6a89d1,02/03/2017 19:51,Test Donor,Complete
5645,manual@givewp.com,Manual,Test,,,,,,,5634,Simple Recurring Donors Choice,25,manual_donation,5645,480ff5be6154e4c94ffb9750628a94b7,02/01/2017 14:23,guest,Complete
5644,manual@givewp.com,Manual,Test,,,,,,,5634,Simple Recurring Donors Choice,25,manual_donation,5644,3f5392e9d42e8e6f50e0367a800f9b64,02/01/2017 14:23,guest,Complete
5642,manual@givewp.com,Manual,Test,,,,,,,5636,Multi-Level Recurring,20,manual_donation,5642,147170ed5c6f03fe462d46a3d6a3612d,02/01/2017 14:21,guest,Complete
5640,manual@givewp.com,Manual,Test,,,,,,,5632,Simple Recurring Admin Choice,42,PayPal Standard,,942b8ca3bf8a7d0dbb8bf4d30b610dc0,02/01/2017 14:20,guest,Complete
5638,manual@givewp.com,Manual,Test,,,,,,,5570,New Form,72,manual_donation,5638,1f16d88bd4611ca0cfd07c0ea36d9e96,02/01/2017 14:17,guest,Complete
5602,pjoseph@givewp.com,Peter,Joseph,,,,,,,5570,New Form,42,PayPal Standard,,9f8185a692ce09269332674bb7b77938,01/25/2017 19:17,Noah,Failed
5600,haftner@example.com,Matt,Smith,,,,,,,5570,New Form,1,PayPal Standard,,7ed06b602d4b03737b2507e5eb8994d7,01/23/2017 19:28,Noah,Abandoned
5599,haftner@example.com,Matt,Smith,1234 Street,Suite #201,San Diego,CA,US,92115,5588,Offline Donations,1,Offline Donation,5599,1db53f36104774b0c37dc73808e0a739,01/17/2017 21:48,Noah,Abandoned
5596,haftner@example.com,Matt,Smith,,,,,,,5574,Donor Registration Form,1,Test Donation,5596,f80f3a146fc405c8f51972d16082228f,01/17/2017 19:39,Noah,Complete
